Löst: execution of ./configure failed, exit code 77

Tråden skapades och har fått 5 svar. Det senaste inlägget skrevs .
1
  • Medlem
  • International user
  • 2004-06-15 10:56

Hej, har en fräsch installation av Panther på min bärbara, satt hela kvällen igår och installerade program och uppdaterade till senaste versionen av allt.

Nu idag på morgonen när allt var färdigt så vill förståss inte Fink eller Darwinports kompilera något åt mig (igår innan 10.3.4 fungerade det.) . Har installerat om Developer tools utan något bättre resultat. Developer tools är v. 1.2 som jag fick av en snäll medlem här. Tidigare hade/har jag samma problem med 10.3.3 och dev tools v. 1.1. Nu kör jag 10.3.4 och problemet dyker upp igen. Är jag verkligen ensam om denna j****a skiten ??.

Ni får ursäkta men jag blir så förbannad på skiten.

Vad jag försökte göra nu var att jag tänkte testa tipset om "transparant eterm" som Johan_S lärde ut, men det skiter sig redan på "fink selfupdate" när datorn inte vill kompilera tar.
Detta är vad den säger :

checking for a BSD-compatible install... /usr/bin/install -c
checking whether build environment is sane... yes
sed: 2: conftest.sed: invalid command code ?
checking for gawk... no
checking for mawk... no
checking for nawk... no
checking for awk... awk
checking whether make sets $(MAKE)... no
checking for style of include used by make... none
checking for gcc... gcc
checking for C compiler default output file name... configure: error: C compiler cannot create executables
See `config.log' for more details.
### execution of ./configure failed, exit code 77
Failed: compiling tar-1.14-1 failed

config.log säger följande:

"Klipp"

4VK1ZzI gC\\A//,PW>=^SrVP<pi-AORxI uBGpMr@YHJbZconfigure:1412: checking for a BSD-compatible install
configure:1467: result: /usr/bin/install -c
configure:1478: checking whether build environment is sane
configure:1521: result: yes
configure:1572: checking for gawk
configure:1601: result: no
configure:1572: checking for mawk
configure:1601: result: no
configure:1572: checking for nawk
configure:1601: result: no
configure:1572: checking for awk
configure:1588: found /usr/bin/awk
configure:1598: result: awk
configure:1608: checking whether make sets $(MAKE)
configure:1632: result: no
configure:1811: checking for style of include used by make
configure:1839: result: none
configure:1910: checking for gcc
configure:1926: found /usr/bin/gcc
configure:1936: result: gcc
configure:2180: checking for C compiler version
configure:2183: gcc --version </dev/null >&5
gcc (GCC) 3.3 20030304 (Apple Computer, Inc. build 1640)
Copyright (C) 2002 Free Software Foundation, Inc.
This is free software; see the source for copying conditions. There is NO
warranty; not even for MERCHANTABILITY or FITNESS FOR A PARTICULAR PURPOSE.

configure:2186: $? = 0
configure:2188: gcc -v </dev/null >&5
Reading specs from /usr/libexec/gcc/darwin/ppc/3.3/specs
Thread model: posix
gcc version 3.3 20030304 (Apple Computer, Inc. build 1640)
configure:2191: $? = 0
configure:2193: gcc -V </dev/null >&5
gcc: `-V' option must have argument
configure:2196: $? = 1
configure:2219: checking for C compiler default output file name
configure:2222: gcc -I/sw/include -L/sw/lib conftest.c >&5
conftest.c:1: error: stray '\217' in program
conftest.c:1: error: parse error before '-' token
conftest.c:1: error: stray '\273' in program
conftest.c:1: error: stray '\334' in program
conftest.c:1: error: stray '`' in program
conftest.c:1: error: syntax error at '@' token
conftest.c:1: error: stray '\366' in program
conftest.c:2: error: stray '\264' in program
conftest.c:2: error: stray '\26' in program
conftest.c:2: error: stray '\213' in program
conftest.c:2: error: stray '\32' in program
conftest.c:2: error: stray '\211' in program
conftest.c:2: error: stray '\347' in program
conftest.c:3: error: stray '\217' in program
conftest.c:3: error: stray '\273' in program
conftest.c:3: error: stray '\334' in program
conftest.c:3: error: stray '`' in program
conftest.c:3: error: syntax error at '@' token
conftest.c:3: error: stray '\366' in program
conftest.c:4: error: stray '\264' in program
conftest.c:4: error: stray '\26' in program
conftest.c:4: error: stray '\213' in program
conftest.c:4: error: stray '\32' in program

"Klipp"

onftest.c:13: error: stray '\342' in program
configure:2225: $? = 1
configure: failed program was:
| tO-;\`:@v
| 4VK1ZzI g
| tO-;\`:@v
| 4VK1ZzI gC\\A//,PW>=^tO-;\`:@v
| 4VK1ZzI gC\\A//,PW>=tO-;\`:@v
| 4VK1ZzI gC\\A//,PW>=^tO-;\`:@v
| 4VK1ZzI gC\\A//,PW>=^SrVP<pitO-;\`:@v
| 4VK1ZzI gC\\A//,PW>=^SrVP<pi-AORxItO-;\`:@v
| 4VK1ZzI gC\\tO-;\`:@v
| 4VK1ZzI gC\\AtO-;\`:@v
| 4VK1ZzI gC\\tO-;\`:@v
| 4VK1ZzI gC\\A//,PW>=^SrVP<pi-AORxI uBGpMr@YHJbZ
configure:2264: error: C compiler cannot create executables
See `config.log' for more details.

"Klipp"

configure: exit 77

Darwinports säger detta när jag kör: "port install wget"

Command output: configuring for GNU Wget 1.9.1
checking build system type... powerpc-apple-darwin7.4.0
checking host system type... powerpc-apple-darwin7.4.0
checking whether make sets $(MAKE)... no
checking for a BSD-compatible install... /usr/bin/install -c
checking for gcc... gcc
checking for C compiler default output... configure: error: C compiler cannot create executables
See `config.log' for more details.

Hoppas någon av er där ute kan hjälpa mig

//linus

Senast redigerat 2004-06-16 06:48

Det verkar ju som att nåt är fel på dina developer tools, då inte ens gcc verkar fungera.
Är de nyaste Xcode du kör med?

  • Medlem
  • International user
  • 2004-06-15 11:19

japps är nyaste, problemet jag haft är att både senaste och 1.0 samt 1.1 har blivit korrupta på samma sätt.

#tillägg. Igår kväll när jag installerade Fink samt darwinports fungerade gcc utan problem så problemet verkar uppträda i samband med uppdateringen till 10.3.4, som gjordes efter installationen av Fink och darwinports.

#tillägg 2. Jag försöker mig på en fuling, installerar Xcode på flickvännens dator (som inte är hemma så jag hinner ta bort devtools innan hon kommer hem )och kopierar över gcc därifrån så får vi se vad som händer

Senast redigerat 2004-06-15 11:31

mm, men förmodligen kan de ju tänkas att de är mer än bara gcc som är pajj om hela Xcode på nåt sätt inte fungerar som de ska.. Men de är ju värt ett försök

  • Medlem
  • International user
  • 2004-06-15 14:37

Blåste rent coh installerade Developer tools samt fink det sista jag gjorde och nu verkar det fungera (för tillfället).

  • Medlem
  • International user
  • 2004-06-16 06:53

Vet vad som är/var felet nu. Satt igår och gjorde kompiliringar efter varje installerat program för att se när/var/om dev tools:en verkar "gå sönder".

Jag använder mig av http://www.jiiva.com/autoscrubber/ tydligen/uppenbarligen finns det stunder när man behöver slå av programet, som exempelvis när man ska genomföra en kompilering. Ingen kul läxa, men gött att jag nu hittat roten till problemet. Tänkte dela med mig av det så kanske någon slipper lite huvudvärk och mycket möda.

1
Bevaka tråden